Target
Thyrotropin-releasing hormone receptor
Ligand
BDBM50158404
Substrate
Meas. Tech.
ChEMBL_1564320 (CHEMBL3784641)
IC50
>50000±n/a nM
Citation
 Meena, CLThakur, ANandekar, PPSharma, SSSangamwar, ATJain, R Synthesis and biology of ring-modified l-Histidine containing thyrotropin-releasing hormone (TRH) analogues. Eur J Med Chem 111:72-83 (2016)  
Target
Name:
Thyrotropin-releasing hormone receptor
Synonyms:
TRH-R2 | Thyrotropin-releasing hormone receptor 2
Type:
PROTEIN
Mol. Mass.:
27545.04
Organism:
Mus musculus
Description:
ChEMBL_109850
Residue:
251
  
Inhibitor
Name:
BDBM50158404
Synonyms:
CHEMBL3780373
Type:
Small organic molecule
Emp. Form.:
C19H27BrN6O4
Mol. Mass.:
483.359
SMILES:
CCCn1cc(C[C@H](NC(=O)[C@@H]2CCC(=O)N2)C(=O)N2CCC[C@H]2C(N)=O)nc1Br
: