Target
Thyrotropin-releasing hormone receptor
Ligand
BDBM50158532
Substrate
Meas. Tech.
ChEMBL_1564320 (CHEMBL3784641)
IC50
>50000±n/a nM
Citation
 Meena, CLThakur, ANandekar, PPSharma, SSSangamwar, ATJain, R Synthesis and biology of ring-modified l-Histidine containing thyrotropin-releasing hormone (TRH) analogues. Eur J Med Chem 111:72-83 (2016)  
Target
Name:
Thyrotropin-releasing hormone receptor
Synonyms:
TRH-R2 | Thyrotropin-releasing hormone receptor 2
Type:
PROTEIN
Mol. Mass.:
27545.04
Organism:
Mus musculus
Description:
ChEMBL_109850
Residue:
251
  
Inhibitor
Name:
BDBM50158532
Synonyms:
CHEMBL3781522
Type:
Small organic molecule
Emp. Form.:
C17H23ClN6O4
Mol. Mass.:
410.855
SMILES:
Cn1cc(C[C@H](NC(=O)[C@@H]2CCC(=O)N2)C(=O)N2CCC[C@H]2C(N)=O)nc1Cl
: