Target
Lysine-specific demethylase 4E
Ligand
BDBM50158849
Substrate
Meas. Tech.
ChEMBL_1565784 (CHEMBL3789169)
IC50
5000±n/a nM
Citation
 McAllister, TEEngland, KSHopkinson, RJBrennan, PEKawamura, ASchofield, CJ Recent Progress in Histone Demethylase Inhibitors. J Med Chem 59:1308-29 (2016)  
Target
Name:
Lysine-specific demethylase 4E
Synonyms:
2-OG-Dependent Histone Demethylase JMJD2E Jumonji domain-containing protein 2E (JMJD2E) KDM4DL KDM4E_HUMAN Lysine-specific demethylase 4E | Lysine-specific demethylase 4E (KDM4E)
Type:
Enzyme
Mol. Mass.:
56815.71
Organism:
Homo sapiens (Human)
Description:
B2RXH2
Residue:
506
  
Inhibitor
Name:
BDBM50158849
Synonyms:
CHEMBL3785164
Type:
Small organic molecule
Emp. Form.:
C22H17ClN2O2S
Mol. Mass.:
408.901
SMILES:
Cc1ccsc1C(NC(=O)c1ccccc1)c1cc(Cl)c2cccnc2c1O
: