Target
Lysine-specific demethylase 6B
Ligand
BDBM50158857
Substrate
Meas. Tech.
ChEMBL_1566336 (CHEMBL3789215)
IC50
>2500±n/a nM
Citation
 McAllister, TEEngland, KSHopkinson, RJBrennan, PEKawamura, ASchofield, CJ Recent Progress in Histone Demethylase Inhibitors. J Med Chem 59:1308-29 (2016)  
Target
Name:
Lysine-specific demethylase 6B
Synonyms:
JMJD3 Jumonji domain-containing protein 3 KDM6B_HUMAN Lysine demethylase 6B Lysine-specific demethylase 6B (KDM6B(JMJD3)) | Lysine-specific demethylase 6B (KDM6B)
Type:
Protein
Mol. Mass.:
176672.55
Organism:
Homo sapiens (Human)
Description:
O15054
Residue:
1643
  
Inhibitor
Name:
BDBM50158857
Synonyms:
CHEMBL3787547
Type:
Small organic molecule
Emp. Form.:
C15H25N3O
Mol. Mass.:
263.3785
SMILES:
CCN(CC)CCCCNCc1cc(C=O)ccn1
: