Target
Metabotropic glutamate receptor 3
Ligand
BDBM50426288
Substrate
Meas. Tech.
ChEMBL_1568362 (CHEMBL3789015)
EC50
>1000000±n/a nM
Citation
 Huynh, THErichsen, MNTora, ASGoudet, CSagot, EAssaf, ZThomsen, CBrodbeck, RStensbøl, TBBjørn-Yoshimoto, WENielsen, BPin, JPGefflaut, TBunch, L New 4-Functionalized Glutamate Analogues Are Selective Agonists at Metabotropic Glutamate Receptor Subtype 2 or Selective Agonists at Metabotropic Glutamate Receptor Group III. J Med Chem 59:914-24 (2016)  
Target
Name:
Metabotropic glutamate receptor 3
Synonyms:
GRM3_RAT Grm3 glutamate receptor, metabotropic 3 precursor
Type:
Protein
Mol. Mass.:
98971.84
Organism:
Rattus norvegicus (Rat)
Description:
P31422
Residue:
879
  
Inhibitor
Name:
BDBM50426288
Synonyms:
CHEMBL2312684
Type:
Small organic molecule
Emp. Form.:
C7H14N2O4
Mol. Mass.:
190.1971
SMILES:
NCC[C@H](C[C@H](N)C(O)=O)C(O)=O
: