Target
Metabotropic glutamate receptor 2
Ligand
BDBM50252049
Substrate
Meas. Tech.
ChEMBL_1568361 (CHEMBL3789014)
EC50
1630±n/a nM
Citation
 Huynh, THErichsen, MNTora, ASGoudet, CSagot, EAssaf, ZThomsen, CBrodbeck, RStensbøl, TBBjørn-Yoshimoto, WENielsen, BPin, JPGefflaut, TBunch, L New 4-Functionalized Glutamate Analogues Are Selective Agonists at Metabotropic Glutamate Receptor Subtype 2 or Selective Agonists at Metabotropic Glutamate Receptor Group III. J Med Chem 59:914-24 (2016)  
Target
Name:
Metabotropic glutamate receptor 2
Synonyms:
GPRC1B GRM2_HUMAN Metabotropic glutamate receptor mGlu2 | metabotropic glutamate 2
Type:
Enzyme
Mol. Mass.:
95584.88
Organism:
Homo sapiens (Human)
Description:
Q14416
Residue:
872
  
Inhibitor
Name:
BDBM50252049
Synonyms:
(1S,3R)-1-aminopentane-1,3,5-tricarboxylic acid CHEMBL482081
Type:
Small organic molecule
Emp. Form.:
C8H13NO6
Mol. Mass.:
219.1919
SMILES:
N[C@@H](C[C@@H](CCC(O)=O)C(O)=O)C(O)=O
: