Target
Metabotropic glutamate receptor 1
Ligand
BDBM50159150
Substrate
Meas. Tech.
ChEMBL_1568366 (CHEMBL3789019)
EC50
>1000000±n/a nM
Citation
 Huynh, THErichsen, MNTora, ASGoudet, CSagot, EAssaf, ZThomsen, CBrodbeck, RStensbøl, TBBjørn-Yoshimoto, WENielsen, BPin, JPGefflaut, TBunch, L New 4-Functionalized Glutamate Analogues Are Selective Agonists at Metabotropic Glutamate Receptor Subtype 2 or Selective Agonists at Metabotropic Glutamate Receptor Group III. J Med Chem 59:914-24 (2016)  
Target
Name:
Metabotropic glutamate receptor 1
Synonyms:
GRM1_RAT Grm1 Metabotropic glutamate receptor Mglur1 metabotropic glutamate 1/5-D metabotropic glutamate receptor 1 isoform alpha precursor
Type:
Enzyme Catalytic Domain
Mol. Mass.:
133240.47
Organism:
RAT
Description:
metabotropic glutamate 1/2 0 RAT::P23385
Residue:
1199
  
Inhibitor
Name:
BDBM50159150
Synonyms:
CHEMBL3787264
Type:
Small organic molecule
Emp. Form.:
C8H11NO6
Mol. Mass.:
217.176
SMILES:
[H][C@@]1(C[C@]1(C[C@H](N)C(O)=O)C(O)=O)C(O)=O
: