Target
Excitatory amino acid transporter 2
Ligand
BDBM50252049
Substrate
Meas. Tech.
ChEMBL_1568621 (CHEMBL3791054)
IC50
>300000±n/a nM
Citation
 Huynh, THErichsen, MNTora, ASGoudet, CSagot, EAssaf, ZThomsen, CBrodbeck, RStensbøl, TBBjørn-Yoshimoto, WENielsen, BPin, JPGefflaut, TBunch, L New 4-Functionalized Glutamate Analogues Are Selective Agonists at Metabotropic Glutamate Receptor Subtype 2 or Selective Agonists at Metabotropic Glutamate Receptor Group III. J Med Chem 59:914-24 (2016)  
Target
Name:
Excitatory amino acid transporter 2
Synonyms:
EAA2_HUMAN GLT1 SLC1A2 Solute carrier family 1 member 2
Type:
Enzyme Catalytic Domain
Mol. Mass.:
62103.57
Organism:
Homo sapiens (Human)
Description:
Excitatory Amino Acid EAAT2 0 0::P43004
Residue:
574
  
Inhibitor
Name:
BDBM50252049
Synonyms:
(1S,3R)-1-aminopentane-1,3,5-tricarboxylic acid CHEMBL482081
Type:
Small organic molecule
Emp. Form.:
C8H13NO6
Mol. Mass.:
219.1919
SMILES:
N[C@@H](C[C@@H](CCC(O)=O)C(O)=O)C(O)=O
: