Target
Neurotensin receptor type 1
Ligand
BDBM50159183
Substrate
Meas. Tech.
ChEMBL_1568948 (CHEMBL3789067)
Ki
1.7±n/a nM
Citation
 Keller, MKuhn, KKEinsiedel, JHübner, HBiselli, SMollereau, CWifling, DSvobodová, JBernhardt, GCabrele, CVanderheyden, PMGmeiner, PBuschauer, A Mimicking of Arginine by Functionalized N(¿)-Carbamoylated Arginine As a New Broadly Applicable Approach to Labeled Bioactive Peptides: High Affinity Angiotensin, Neuropeptide Y, Neuropeptide FF, and Neurotensin Receptor Ligands As Examples. J Med Chem 59:1925-45 (2016)  
Target
Name:
Neurotensin receptor type 1
Synonyms:
Dopamine receptor D2L/neurotensin receptor NTS1 NTRR Neurotensin receptor 1 | neurotensin receptor type 1
Type:
PROTEIN
Mol. Mass.:
46278.89
Organism:
Homo sapiens (Human)
Description:
ChEMBL_1453811
Residue:
418
  
Inhibitor
Name:
BDBM50159183
Synonyms:
CHEMBL3787095
Type:
Small organic molecule
Emp. Form.:
C75H105F9N16O21S
Mol. Mass.:
1769.781
SMILES:
OC(=O)C(F)(F)F.OC(=O)C(F)(F)F.OC(=O)C(F)(F)F.CC[C@H](C)[C@H](NC(=O)[C@H](Cc1ccc(O)cc1)NC(=O)[C@@H]1CCCN1C(=O)[C@H](CCCNC(N)=N)NC(=O)[C@@H](N)CCCN\C(N)=N\C(=O)NCCCCNC(=O)CCCCC[n+]1cc(ccc1\C=C\c1cc2ccc(cc2oc1=O)N(CC)CC)S([O-])(=O)=O)C(=O)N[C@@H](CC(C)C)C(O)=O
: