Target
Adenosine receptor A2b
Ligand
BDBM50159499
Substrate
Meas. Tech.
ChEMBL_1569186 (CHEMBL3791369)
Ki
30±n/a nM
Citation
 El Maatougui, AAzuaje, JGonzález-Gómez, MMiguez, GCrespo, ACarbajales, CEscalante, LGarcía-Mera, XGutiérrez-de-Terán, HSotelo, E Discovery of Potent and Highly Selective A2B Adenosine Receptor Antagonist Chemotypes. J Med Chem 59:1967-83 (2016)  
Target
Name:
Adenosine receptor A2b
Synonyms:
AA2BR_HUMAN ADORA2B Adenosine receptors A2b | Adenosine receptors; A2a & A2b
Type:
G Protein-Coupled Receptor (GPCR)
Mol. Mass.:
36341.22
Organism:
Homo sapiens (Human)
Description:
Residue:
332
  
Inhibitor
Name:
BDBM50159499
Synonyms:
CHEMBL3785618
Type:
Small organic molecule
Emp. Form.:
C18H17N3O2S
Mol. Mass.:
339.411
SMILES:
CCOC(=O)C1=C(C)Nc2nc3ccccc3n2C1c1ccsc1
: