Target
Glutamate receptor ionotropic, kainate 3
Ligand
BDBM50159750
Substrate
Meas. Tech.
ChEMBL_1569975 (CHEMBL3789123)
Ki
>100000±n/a nM
Citation
 Wang, SYLarsen, YNavarrete, CVJensen, AANielsen, BAl-Musaed, AFrydenvang, KKastrup, JSPickering, DSClausen, RP Tweaking Subtype Selectivity and Agonist Efficacy at (S)-2-Amino-3-(3-hydroxy-5-methyl-isoxazol-4-yl)propionic acid (AMPA) Receptors in a Small Series of BnTetAMPA Analogues. J Med Chem 59:2244-54 (2016)  
Target
Name:
Glutamate receptor ionotropic, kainate 3
Synonyms:
GRIK3_RAT Glutamate receptor ionotropic kainate 3 Grik3
Type:
PROTEIN
Mol. Mass.:
104080.46
Organism:
Rattus norvegicus
Description:
ChEMBL_1447329
Residue:
919
  
Inhibitor
Name:
BDBM50159750
Synonyms:
CHEMBL3786611
Type:
Small organic molecule
Emp. Form.:
C18H23N7O4
Mol. Mass.:
401.4197
SMILES:
CC(C)NCc1cccc(Cn2nnc(n2)-c2onc(O)c2C[C@H](N)C(O)=O)c1
: