Target
Fatty-acid amide hydrolase 1 [30-579]
Ligand
BDBM50160277
Substrate
Meas. Tech.
ChEMBL_1566101 (CHEMBL3791985)
IC50
3678±n/a nM
Citation
 Brindisi, MMaramai, SGemma, SBrogi, SGrillo, ADi Cesare Mannelli, LGabellieri, ELamponi, SSaponara, SGorelli, BTedesco, DBonfiglio, TLandry, CJung, KMArmirotti, ALuongo, LLigresti, APiscitelli, FBertucci, CDehouck, MPCampiani, GMaione, SGhelardini, CPittaluga, APiomelli, DDi Marzo, VButini, S Development and Pharmacological Characterization of Selective Blockers of 2-Arachidonoyl Glycerol Degradation with Efficacy in Rodent Models of Multiple Sclerosis and Pain. J Med Chem 59:2612-32 (2016)  
Target
Name:
Fatty-acid amide hydrolase 1 [30-579]
Synonyms:
Anandamide amidohydrolase 1 Faah Fatty Acid Amide Hydrolase Fatty-acid amide hydrolase (FAAH) Fatty-acid amide hydrolase 1 (FAAH) Oleamide hydrolase 1
Type:
Single-pass membrane protein; homodimer
Mol. Mass.:
60474.00
Organism:
Rattus norvegicus (rat)
Description:
P97612 (aa 30-579)
Residue:
550
  
Inhibitor
Name:
BDBM50160277
Synonyms:
CHEMBL3785536
Type:
Small organic molecule
Emp. Form.:
C25H27N5O4
Mol. Mass.:
461.513
SMILES:
COc1ccc(cc1)[C@@H]1[C@H](C(=O)N1C1CCN(CC1)C(=O)n1cncn1)c1ccc(OC)cc1
: