Target
Metabotropic glutamate receptor 1
Ligand
BDBM50160568
Substrate
Meas. Tech.
ChEMBL_1569844 (CHEMBL3788049)
IC50
28±n/a nM
Citation
 Felts, ASRodriguez, ALMorrison, RDVenable, DFBlobaum, ALByers, FWDaniels, JSNiswender, CMJones, CKConn, PJLindsley, CWEmmitte, KA N-Alkylpyrido[1',2':1,5]pyrazolo-[4,3-d]pyrimidin-4-amines: A new series of negative allosteric modulators of mGlu1/5 with CNS exposure in rodents. Bioorg Med Chem Lett 26:1894-900 (2016)  
Target
Name:
Metabotropic glutamate receptor 1
Synonyms:
GPRC1A GRM1_HUMAN Metabotropic Glutamate 1a | metabotropic glutamate 1
Type:
Enzyme
Mol. Mass.:
132358.19
Organism:
Homo sapiens (Human)
Description:
Q13255
Residue:
1194
  
Inhibitor
Name:
BDBM50160568
Synonyms:
CHEMBL3786530
Type:
Small organic molecule
Emp. Form.:
C19H23N3OS
Mol. Mass.:
341.47
SMILES:
OCCSc1nc2CCCCc2c(NC2Cc3ccccc3C2)n1
: