Target
Metabotropic glutamate receptor 1
Ligand
BDBM50160418
Substrate
Meas. Tech.
ChEMBL_1569846 (CHEMBL3788051)
IC50
69±n/a nM
Citation
 Felts, ASRodriguez, ALMorrison, RDVenable, DFBlobaum, ALByers, FWDaniels, JSNiswender, CMJones, CKConn, PJLindsley, CWEmmitte, KA N-Alkylpyrido[1',2':1,5]pyrazolo-[4,3-d]pyrimidin-4-amines: A new series of negative allosteric modulators of mGlu1/5 with CNS exposure in rodents. Bioorg Med Chem Lett 26:1894-900 (2016)  
Target
Name:
Metabotropic glutamate receptor 1
Synonyms:
GRM1_RAT Grm1 Metabotropic glutamate receptor Mglur1 metabotropic glutamate 1/5-D metabotropic glutamate receptor 1 isoform alpha precursor
Type:
Enzyme Catalytic Domain
Mol. Mass.:
133240.47
Organism:
RAT
Description:
metabotropic glutamate 1/2 0 RAT::P23385
Residue:
1199
  
Inhibitor
Name:
BDBM50160418
Synonyms:
CHEMBL3787247
Type:
Small organic molecule
Emp. Form.:
C17H21N5
Mol. Mass.:
295.3821
SMILES:
CC1(C)CCC(CC1)Nc1ncnc2c1nn1ccccc21
: