Target
Melanin-concentrating hormone receptor 1
Ligand
BDBM50163466
Substrate
Meas. Tech.
ChEMBL_1572136 (CHEMBL3796860)
IC50
40±n/a nM
Citation
 Igawa, HTakahashi, MShirasaki, MKakegawa, KKina, AIkoma, MAida, JYasuma, TOkuda, SKawata, YNoguchi, TYamamoto, SFujioka, YKundu, MKhamrai, UNakayama, MNagisa, YKasai, SMaekawa, T Amine-free melanin-concentrating hormone receptor 1 antagonists: Novel 1-(1H-benzimidazol-6-yl)pyridin-2(1H)-one derivatives and design to avoid CYP3A4 time-dependent inhibition. Bioorg Med Chem 24:2486-503 (2016)  
Target
Name:
Melanin-concentrating hormone receptor 1
Synonyms:
G-protein coupled receptor 24 MCH receptor 1 MCH-R1 MCHR-1 MCHR1_HUMAN Melanin-Concentrating Hormone Receptor 1 (MCH1R) Melanin-concentrating hormone receptor 1 (MCH-1) Melanin-concentrating hormone receptor 1 (MCHR-1) SLC-1 Somatostatin receptor-like protein
Type:
G Protein-Coupled Receptor (GPCR)
Mol. Mass.:
45976.27
Organism:
Homo sapiens (Human)
Description:
Membranes from CHO-K1 cells stably expressing human MCH1R were used in assays.
Residue:
422
  
Inhibitor
Name:
BDBM50163466
Synonyms:
CHEMBL3793767
Type:
Small organic molecule
Emp. Form.:
C23H20FN3O2
Mol. Mass.:
389.4222
SMILES:
Cn1c(nc2ccc(cc12)-n1ccc(OCc2ccc(F)cc2)cc1=O)C1CC1
: