Target
Corticotropin-releasing factor receptor 1
Ligand
BDBM50161854
Substrate
Meas. Tech.
ChEMBL_1572346 (CHEMBL3795929)
IC50
15±n/a nM
Citation
 Mochizuki, MKori, MKobayashi, KYano, TSako, YTanaka, MKanzaki, NGyorkos, ACCorrette, CPCho, SYPratt, SAAso, K Design and Synthesis of Benzimidazoles As Novel Corticotropin-Releasing Factor 1 Receptor Antagonists. J Med Chem 59:2551-66 (2016)  
Target
Name:
Corticotropin-releasing factor receptor 1
Synonyms:
CRF-R CRF1 CRFR1 CRH-R 1 CRHR1 Corticotropin-releasing factor receptor 1 (CRF-1) Corticotropin-releasing hormone receptor 1
Type:
Enzyme
Mol. Mass.:
50744.31
Organism:
Homo sapiens (Human)
Description:
P34998
Residue:
444
  
Inhibitor
Name:
BDBM50161854
Synonyms:
CHEMBL3794051
Type:
Small organic molecule
Emp. Form.:
C23H32N4
Mol. Mass.:
364.527
SMILES:
CCCN(CCC)c1cccc2nc(Nc3c(C)cc(C)cc3C)n(C)c12
: