Target
Peptidyl-prolyl cis-trans isomerase FKBP5
Ligand
BDBM50125330
Substrate
Meas. Tech.
ChEMBL_1570260 (CHEMBL3795202)
Ki
6.0±n/a nM
Citation
 Gaali, SFeng, XHähle, ASippel, CBracher, AHausch, F Rapid, Structure-Based Exploration of Pipecolic Acid Amides as Novel Selective Antagonists of the FK506-Binding Protein 51. J Med Chem 59:2410-22 (2016)  
Target
Name:
Peptidyl-prolyl cis-trans isomerase FKBP5
Synonyms:
51 kDa FK506-binding protein 54 kDa progesterone receptor-associated immunophilin Androgen-regulated protein 6 FK506-binding protein 5 FKBP-51 FKBP51 FKBP5_HUMAN PPIase FKBP5 p54
Type:
PROTEIN
Mol. Mass.:
51207.06
Organism:
Homo sapiens (Human)
Description:
ChEMBL_952910
Residue:
457
  
Inhibitor
Name:
BDBM50125330
Synonyms:
CHEMBL3623630
Type:
Small organic molecule
Emp. Form.:
C46H62N2O10
Mol. Mass.:
802.9919
SMILES:
COc1ccc(CC[C@@H](OC(=O)[C@@H]2CCCCN2C(=O)[C@@H](C2CCCCC2)c2cc(OC)c(OC)c(OC)c2)c2cccc(OCCN3CCOCC3)c2)cc1OC
: