Target
Peptidyl-prolyl cis-trans isomerase FKBP5
Ligand
BDBM50162662
Substrate
Meas. Tech.
ChEMBL_1570257 (CHEMBL3795199)
Ki
5000±n/a nM
Citation
 Gaali, SFeng, XHähle, ASippel, CBracher, AHausch, F Rapid, Structure-Based Exploration of Pipecolic Acid Amides as Novel Selective Antagonists of the FK506-Binding Protein 51. J Med Chem 59:2410-22 (2016)  
Target
Name:
Peptidyl-prolyl cis-trans isomerase FKBP5
Synonyms:
51 kDa FK506-binding protein 54 kDa progesterone receptor-associated immunophilin Androgen-regulated protein 6 FK506-binding protein 5 FKBP-51 FKBP51 FKBP5_HUMAN PPIase FKBP5 p54
Type:
PROTEIN
Mol. Mass.:
51207.06
Organism:
Homo sapiens (Human)
Description:
ChEMBL_952910
Residue:
457
  
Inhibitor
Name:
BDBM50162662
Synonyms:
CHEMBL3793635
Type:
Small organic molecule
Emp. Form.:
C28H43N3O6
Mol. Mass.:
517.6575
SMILES:
COc1cc(cc(OC)c1OC)[C@H](C1CCCCC1)C(=O)N1CCCC[C@H]1C(=O)N[C@H](C(C)C)C(N)=O
: