Target
Cyclin-dependent kinase 8
Ligand
BDBM50163782
Substrate
Meas. Tech.
ChEMBL_1572641 (CHEMBL3803436)
IC50
4.5±n/a nM
Citation
 Mallinger, ASchiemann, KRink, CStieber, FCalderini, MCrumpler, SStubbs, MAdeniji-Popoola, OPoeschke, OBusch, MCzodrowski, PMusil, DSchwarz, DOrtiz-Ruiz, MJSchneider, RThai, CValenti, Mde Haven Brandon, ABurke, RWorkman, PDale, TWienke, DClarke, PAEsdar, CRaynaud, FIEccles, SARohdich, FBlagg, J Discovery of Potent, Selective, and Orally Bioavailable Small-Molecule Modulators of the Mediator Complex-Associated Kinases CDK8 and CDK19. J Med Chem 59:1078-101 (2016)  
Target
Name:
Cyclin-dependent kinase 8
Synonyms:
CDK8 Cell division protein kinase 8 Mediator complex subunit CDK8 Protein kinase K35
Type:
Serine/threonine-protein kinase
Mol. Mass.:
53300.21
Organism:
Homo sapiens (Human)
Description:
P49336
Residue:
464
  
Inhibitor
Name:
BDBM50163782
Synonyms:
CHEMBL3797495
Type:
Small organic molecule
Emp. Form.:
C21H22ClN5O3S
Mol. Mass.:
459.949
SMILES:
CN1c2ccc(cc2CS1(=O)=O)-c1cncc(Cl)c1N1CCC2(CC1)N=C(C)NC2=O
: