Target
Glutamate receptor 2
Ligand
BDBM50164477
Substrate
Meas. Tech.
ChEMBL_1574106 (CHEMBL3801516)
EC50
150±n/a nM
Citation
 Volgraf, MSellers, BDJiang, YWu, GLy, CQVillemure, EPastor, RMYuen, PWLu, ALuo, XLiu, MZhang, SSun, LFu, YLupardus, PJWallweber, HJLiederer, BMDeshmukh, GPlise, ETay, SReynen, PHerrington, JGustafson, ALiu, YDirksen, ADietz, MGLiu, YWang, TMHanson, JEHackos, DScearce-Levie, KSchwarz, JB Discovery of GluN2A-Selective NMDA Receptor Positive Allosteric Modulators (PAMs): Tuning Deactivation Kinetics via Structure-Based Design. J Med Chem 59:2760-79 (2016)  
Target
Name:
Glutamate receptor 2
Synonyms:
AMPA-selective glutamate receptor 2 GRIA2 GluR-2 GluR-K2 Glutamate receptor 2 Glutamate receptor AMPA 2/3 Glutamate receptor ionotropic, AMPA 2
Type:
Enzyme Catalytic Domain
Mol. Mass.:
98825.96
Organism:
Homo sapiens (Human)
Description:
Glutamate AMPA 2 GRIA2 HUMAN::P42262
Residue:
883
  
Inhibitor
Name:
BDBM50164477
Synonyms:
CHEMBL3800556
Type:
Small organic molecule
Emp. Form.:
C16H14ClF3N4O2S
Mol. Mass.:
418.821
SMILES:
Cc1sc2nc(Cn3nc(cc3Cl)C(F)(F)F)cc(=O)n2c1[C@@H]1C[C@H]1CO
: