Target
Sphingosine 1-phosphate receptor 3
Ligand
BDBM50164499
Substrate
Meas. Tech.
ChEMBL_1574132 (CHEMBL3801747)
EC50
850±n/a nM
Citation
 Watterson, SHGuo, JSpergel, SHLangevine, CMMoquin, RVShen, DRYarde, MCvijic, MEBanas, DLiu, RSuchard, SJGillooly, KTaylor, TRex-Rabe, SShuster, DJMcIntyre, KWCornelius, GD'Arienzo, CMarino, ABalimane, PWarrack, BSalter-Cid, LMcKinnon, MBarrish, JCCarter, PHPitts, WJXie, JDyckman, AJ Potent and Selective Agonists of Sphingosine 1-Phosphate 1 (S1P1): Discovery and SAR of a Novel Isoxazole Based Series. J Med Chem 59:2820-40 (2016)  
Target
Name:
Sphingosine 1-phosphate receptor 3
Synonyms:
C9orf108 EDG3 S1P receptor 3 S1P3 S1PR3_HUMAN Sphingosine 1-phosphate receptor 3 (S1P3) | Sphingosine 1-phosphate receptor Edg-3
Type:
G Protein-Coupled Receptor (GPCR)
Mol. Mass.:
42278.13
Organism:
Homo sapiens (Human)
Description:
Q99500
Residue:
378
  
Inhibitor
Name:
BDBM50164499
Synonyms:
CHEMBL3797951
Type:
Small organic molecule
Emp. Form.:
C23H28N4O4
Mol. Mass.:
424.4928
SMILES:
CCCc1c(CC(C)C)onc1-c1nc(no1)-c1ccc(CN2CC(C2)C(O)=O)cc1
: