Target
Beta-secretase 1
Ligand
BDBM102944
Substrate
Meas. Tech.
ChEMBL_1574683 (CHEMBL3801550)
Ki
9.0±n/a nM
Citation
 Mandal, MWu, YMisiaszek, JLi, GBuevich, ACaldwell, JPLiu, XMazzola, RDOrth, PStrickland, CVoigt, JWang, HZhu, ZChen, XGrzelak, MHyde, LAKuvelkar, RLeach, PTTerracina, GZhang, LZhang, QMichener, MSSmith, BCox, KGrotz, DFavreau, LMitra, KKazakevich, IMcKittrick, BAGreenlee, WKennedy, MEParker, EMCumming, JNStamford, AW Structure-Based Design of an Iminoheterocyclicß-Site Amyloid Precursor Protein Cleaving Enzyme (BACE) Inhibitor that Lowers Central Aß in Nonhuman Primates. J Med Chem 59:3231-48 (2016)  
Target
Name:
Beta-secretase 1
Synonyms:
ASP2 Aspartyl protease 2 BACE1 Beta-secretase (BACE) Beta-secretase 1 (BACE 1) Beta-secretase 1 (BACE1) Beta-site amyloid precursor protein cleaving enzyme 1 Memapsin-2 beta-Secretase (BACE-1) | beta-Secretase (BACE1)
Type:
Protein
Mol. Mass.:
55755.10
Organism:
Homo sapiens (Human)
Description:
P56817
Residue:
501
  
Inhibitor
Name:
BDBM102944
Synonyms:
US8541427, 15 US8541427, 44 | US8541427, 45
Type:
Small organic molecule
Emp. Form.:
C19H19F3N6O2
Mol. Mass.:
420.3884
SMILES:
COc1nc(nc(C)c1F)N1C[C@H]2C(=O)N(C)C(N)=N[C@]2(C1)c1cc(F)ccc1F
: