Target
Histone deacetylase 8
Ligand
BDBM50164515
Substrate
Meas. Tech.
ChEMBL_1575027 (CHEMBL3803862)
IC50
172±n/a nM
Citation
 Heimburg, TChakrabarti, ALancelot, JMarek, MMelesina, JHauser, ATShaik, TBDuclaud, SRobaa, DErdmann, FSchmidt, MRomier, CPierce, RJJung, MSippl, W Structure-Based Design and Synthesis of Novel Inhibitors Targeting HDAC8 from Schistosoma mansoni for the Treatment of Schistosomiasis. J Med Chem 59:2423-35 (2016)  
Target
Name:
Histone deacetylase 8
Synonyms:
HD8 HDAC8_HUMAN Histone deacetylase 8 (HDAC-8) | Human HDAC8
Type:
Enzyme
Mol. Mass.:
41749.60
Organism:
Homo sapiens (Human)
Description:
Q9BY41
Residue:
377
  
Inhibitor
Name:
BDBM50164515
Synonyms:
CHEMBL3798028
Type:
Small organic molecule
Emp. Form.:
C16H16N2O4
Mol. Mass.:
300.3092
SMILES:
CCOc1ccc(cc1NC(=O)c1ccccc1)C(=O)NO
: