Target
Histone deacetylase 6
Ligand
BDBM50164529
Substrate
Meas. Tech.
ChEMBL_1575029 (CHEMBL3803864)
IC50
90±n/a nM
Citation
 Heimburg, TChakrabarti, ALancelot, JMarek, MMelesina, JHauser, ATShaik, TBDuclaud, SRobaa, DErdmann, FSchmidt, MRomier, CPierce, RJJung, MSippl, W Structure-Based Design and Synthesis of Novel Inhibitors Targeting HDAC8 from Schistosoma mansoni for the Treatment of Schistosomiasis. J Med Chem 59:2423-35 (2016)  
Target
Name:
Histone deacetylase 6
Synonyms:
Cereblon/Histone deacetylase 6 HDAC6 Histone deacetylase 6 (HDAC6) KIAA0901 | ORF Names:JM21
Type:
Chromatin regulator; hydrolase; repressor
Mol. Mass.:
131381.51
Organism:
Homo sapiens (Human)
Description:
Q9UBN7
Residue:
1215
  
Inhibitor
Name:
BDBM50164529
Synonyms:
CHEMBL3800615
Type:
Small organic molecule
Emp. Form.:
C14H10Cl2N2O3
Mol. Mass.:
325.147
SMILES:
ONC(=O)c1ccc(Cl)c(NC(=O)c2ccc(Cl)cc2)c1
: