Target
Intestinal-type alkaline phosphatase
Ligand
BDBM50165131
Substrate
Meas. Tech.
ChEMBL_1572749 (CHEMBL3804258)
Ki
5660±n/a nM
Citation
 al-Rashida, MBatool, GSattar, AEjaz, SAKhan, SLecka, JSévigny, JHameed, AIqbal, J 2-Alkoxy-3-(sulfonylarylaminomethylene)-chroman-4-ones as potent and selective inhibitors of ectonucleotidases. Eur J Med Chem 115:484-94 (2016)  
Target
Name:
Intestinal-type alkaline phosphatase
Synonyms:
ALPI Intestinal alkaline phosphatase (IAP) PPBI_BOVIN
Type:
Protein
Mol. Mass.:
57094.82
Organism:
Bos taurus (Cattle)
Description:
P19111
Residue:
533
  
Inhibitor
Name:
BDBM50165131
Synonyms:
CHEMBL3797468
Type:
Small organic molecule
Emp. Form.:
C17H15FN2O5S
Mol. Mass.:
378.375
SMILES:
COC1Oc2ccc(F)cc2C(=O)\C1=C/Nc1cccc(c1)S(N)(=O)=O
: