Target
Serine/threonine-protein kinase 17A
Ligand
BDBM50166211
Substrate
Meas. Tech.
ChEMBL_1575377 (CHEMBL3802095)
IC50
110±n/a nM
Citation
 Jung, MEByun, BJKim, HMLee, JYPark, JHLee, NSon, YHChoi, SUYang, KMKim, SJLee, KKim, YCChoi, G Discovery of indirubin derivatives as new class of DRAK2 inhibitors from high throughput screening. Bioorg Med Chem Lett 26:2719-23 (2016)  
Target
Name:
Serine/threonine-protein kinase 17A
Synonyms:
DRAK1 STK17A
Type:
Enzyme Catalytic Domain
Mol. Mass.:
46544.04
Organism:
Homo sapiens (Human)
Description:
gi_109255245
Residue:
414
  
Inhibitor
Name:
BDBM50166211
Synonyms:
CHEMBL3798579
Type:
Small organic molecule
Emp. Form.:
C23H22N4O3
Mol. Mass.:
402.4458
SMILES:
O\N=C1\C(\Nc2ccccc\12)=C1\C(=O)Nc2ccc(NC(=O)C3CCCCC3)cc12
: