Target
Mitogen-activated protein kinase 3
Ligand
BDBM50166568
Substrate
Meas. Tech.
ChEMBL_1575390 (CHEMBL3802287)
IC50
26±n/a nM
Citation
 Li, LLiu, FJin, NTang, SChen, ZYang, XDing, JGeng, MJiang, LHuang, MCao, J Discovery and structure activity relationship study of novel indazole amide inhibitors for extracellular signal-regulated kinase1/2 (ERK1/2). Bioorg Med Chem Lett 26:2600-4 (2016)  
Target
Name:
Mitogen-activated protein kinase 3
Synonyms:
ERK1 Extracellular signal-regulated kinase 1 MAP kinase ERK1 MAPK3/MAPK7 Mitogen-activated protein kinase PRKM3
Type:
Protein
Mol. Mass.:
43136.58
Organism:
Homo sapiens (Human)
Description:
curated by PDB 4QTB
Residue:
379
  
Inhibitor
Name:
BDBM50166568
Synonyms:
CHEMBL3799614
Type:
Small organic molecule
Emp. Form.:
C19H14ClN5O
Mol. Mass.:
363.8
SMILES:
Clc1cc(CNC(=O)c2ccc3[nH]nc(-c4ccncc4)c3c2)ccn1
: