Target
Protein kinase C delta type
Ligand
BDBM50166588
Substrate
Meas. Tech.
ChEBML_1572583
IC50
>10.0±n/a nM
Citation
 Katoh, TTakai, TYukawa, TTsukamoto, TWatanabe, EMototani, HArita, THayashi, HNakagawa, HKlein, MGZou, HSang, BCSnell, GNakada, Y Discovery and optimization of 1,7-disubstituted-2,2-dimethyl-2,3-dihydroquinazolin-4(1H)-ones as potent and selective PKC¿ inhibitors. Bioorg Med Chem 24:2466-75 (2016)  
Target
Name:
Protein kinase C delta type
Synonyms:
KPCD_HUMAN PKCD Protein Kinase C- delta nPKC-delta
Type:
Enzyme
Mol. Mass.:
77516.79
Organism:
Homo sapiens (Human)
Description:
The recombinant human PKC enzymes were produced using a baculovirus expression system in SF9 cells
Residue:
676
  
Inhibitor
Name:
BDBM50166588
Synonyms:
CHEMBL3798011
Type:
Small organic molecule
Emp. Form.:
C24H23N5O2
Mol. Mass.:
413.4717
SMILES:
C[C@@H](N1c2cc(ccc2C(=O)NC1(C)C)-n1c2cccnc2[nH]c1=O)c1ccccc1
: