Target
Protein kinase C theta type
Ligand
BDBM50164188
Substrate
Meas. Tech.
ChEMBL_1576561 (CHEMBL3804232)
IC50
>1000±n/a nM
Citation
 Katoh, TTakai, TYukawa, TTsukamoto, TWatanabe, EMototani, HArita, THayashi, HNakagawa, HKlein, MGZou, HSang, BCSnell, GNakada, Y Discovery and optimization of 1,7-disubstituted-2,2-dimethyl-2,3-dihydroquinazolin-4(1H)-ones as potent and selective PKC¿ inhibitors. Bioorg Med Chem 24:2466-75 (2016)  
Target
Name:
Protein kinase C theta type
Synonyms:
KPCT_HUMAN PRKCT Protein kinase C theta type (PRKCQ) nPKC-theta
Type:
Serine/threonine-protein kinase
Mol. Mass.:
81878.04
Organism:
Homo sapiens (Human)
Description:
Full-length human PKC theta (Panvera Catalog No. P2996).
Residue:
706
  
Inhibitor
Name:
BDBM50164188
Synonyms:
CHEMBL3799399
Type:
Small organic molecule
Emp. Form.:
C20H23N5O2
Mol. Mass.:
365.4289
SMILES:
CC(C)CN1c2cc(ccc2C(=O)NC1(C)C)-n1c2cccnc2[nH]c1=O
: