Target
Protein kinase C theta type
Ligand
BDBM50164291
Substrate
Meas. Tech.
ChEMBL_1576560 (CHEMBL3804231)
IC50
150±n/a nM
Citation
 Katoh, TTakai, TYukawa, TTsukamoto, TWatanabe, EMototani, HArita, THayashi, HNakagawa, HKlein, MGZou, HSang, BCSnell, GNakada, Y Discovery and optimization of 1,7-disubstituted-2,2-dimethyl-2,3-dihydroquinazolin-4(1H)-ones as potent and selective PKC¿ inhibitors. Bioorg Med Chem 24:2466-75 (2016)  
Target
Name:
Protein kinase C theta type
Synonyms:
KPCT_HUMAN PRKCT Protein kinase C theta type (PRKCQ) nPKC-theta
Type:
Serine/threonine-protein kinase
Mol. Mass.:
81878.04
Organism:
Homo sapiens (Human)
Description:
Full-length human PKC theta (Panvera Catalog No. P2996).
Residue:
706
  
Inhibitor
Name:
BDBM50164291
Synonyms:
CHEMBL3798849
Type:
Small organic molecule
Emp. Form.:
C22H20N6O2
Mol. Mass.:
400.4332
SMILES:
CC1(C)NC(=O)c2ccc(cc2N1Cc1cccnc1)-n1c2cccnc2[nH]c1=O
: