Target
Fibroblast growth factor receptor 2
Ligand
BDBM50166744
Substrate
Meas. Tech.
ChEMBL_1572613 (CHEMBL3803146)
IC50
0.200000±n/a nM
Citation
 Fan, JDai, YShao, JPeng, XWang, CCao, SZhao, BAi, JGeng, MDuan, W Design, synthesis and biological evaluation of pyrazolylaminoquinazoline derivatives as highly potent pan-fibroblast growth factor receptor inhibitors. Bioorg Med Chem Lett 26:2594-9 (2016)  
Target
Name:
Fibroblast growth factor receptor 2
Synonyms:
BEK FGFR-2 FGFR2 Fibroblast growth factor receptor 2 (FGFR2) KGFR Keratinocyte growth factor receptor VEGF-receptor 2 and Fibroblast growth factor receptor 2
Type:
Enzyme
Mol. Mass.:
92015.45
Organism:
Homo sapiens (Human)
Description:
P21802
Residue:
821
  
Inhibitor
Name:
BDBM50166744
Synonyms:
CHEMBL3798625
Type:
Small organic molecule
Emp. Form.:
C28H35N7O2
Mol. Mass.:
501.6232
SMILES:
COc1cc(CCc2cc(Nc3ncnc4cc(ccc34)N3C[C@H](C)N(C)[C@H](C)C3)n[nH]2)cc(OC)c1
: