Target
Fatty-acid amide hydrolase 1
Ligand
BDBM50166870
Substrate
Meas. Tech.
ChEMBL_1573063 (CHEMBL3802167)
IC50
0.360000±n/a nM
Citation
 Pember, SOMejia, GLPrice, TJPasteris, RJ Piperidinyl thiazole isoxazolines: A new series of highly potent, slowly reversible FAAH inhibitors with analgesic properties. Bioorg Med Chem Lett 26:2965-2973 (2016)  
Target
Name:
Fatty-acid amide hydrolase 1
Synonyms:
Anandamide amidohydrolase FAAH FAAH1_HUMAN Fatty-acid amide hydrolase (FAAH) Oleamide hydrolase 1
Type:
Protein
Mol. Mass.:
63071.19
Organism:
Homo sapiens (Human)
Description:
O00519
Residue:
579
  
Inhibitor
Name:
BDBM50166870
Synonyms:
CHEMBL3797226
Type:
Small organic molecule
Emp. Form.:
C25H22F3N3O3S
Mol. Mass.:
501.521
SMILES:
FC(F)(F)c1ccc(OC(=O)N2CCC(CC2)c2nc(cs2)C2=NOC(C2)c2ccccc2)cc1
: