Target
Tyrosine-protein kinase JAK2
Ligand
BDBM50166918
Substrate
Meas. Tech.
ChEMBL_1573077 (CHEMBL3802363)
IC50
786±n/a nM
Citation
 Wang, TLiu, XHao, MQiao, JJu, CXue, LZhang, C Design, synthesis and evaluation of pyrrolo[2,3-d]pyrimidine-phenylamide hybrids as potent Janus kinase 2 inhibitors. Bioorg Med Chem Lett 26:2936-2941 (2016)  
Target
Name:
Tyrosine-protein kinase JAK2
Synonyms:
JAK-2 JAK2_HUMAN Janus kinase 2 (JAK2) | Janus kinase 2 (a protein tyrosine kinase)
Type:
Protein
Mol. Mass.:
130684.68
Organism:
Homo sapiens (Human)
Description:
O60674
Residue:
1132
  
Inhibitor
Name:
BDBM50166918
Synonyms:
CHEMBL3798090
Type:
Small organic molecule
Emp. Form.:
C26H26N4O3
Mol. Mass.:
442.5096
SMILES:
Cn1c(cc2c(ncnc12)-c1ccc(NC(=O)C(C)(C)C)cc1)C(=O)OCc1ccccc1
: