Target
Epidermal growth factor receptor
Ligand
BDBM50166941
Substrate
Meas. Tech.
ChEMBL_1573293 (CHEMBL3804025)
IC50
0.400000±n/a nM
Citation
 Xiao, QQu, RGao, DYan, QTong, LZhang, WDing, JXie, HLi, Y Discovery of 5-(methylthio)pyrimidine derivatives as L858R/T790M mutant selective epidermal growth factor receptor (EGFR) inhibitors. Bioorg Med Chem 24:2673-80 (2016)  
Target
Name:
Epidermal growth factor receptor
Synonyms:
Epidermal growth factor receptor/Receptor tyrosine-protein kinase erbB-2/Receptor tyrosine-protein kinase erbB-3/Receptor tyrosine-protein kinase erbB-4
Type:
Mol. Mass.:
Description:
ASSAY_ID of ChEMBL is 2209351
Components:
This complex has 4 components.
Component 1
Name:
Receptor tyrosine-protein kinase erbB-2
Synonyms:
2.7.10.1 CD_antigen=CD340 ERBB2_HUMAN FASN/HER2 HER2 MLN19 NEU Proto-oncogene Neu Tyrosine kinase-type cell surface receptor HER2 | p185erbB2
Type:
Mol. Mass.:
137894.47
Organism:
Homo sapiens (Human)
Description:
P04626
Residue:
1255
  
Component 2
Name:
Epidermal growth factor receptor
Synonyms:
EGF Receptor Substrate EGFR_HUMAN ERBB1 Epidermal Growth Factor Receptor erbB-1 Epidermal growth factor receptor (EGFR) HER1 Proto-oncogene c-ErbB-1 Tyrosine-Protein Kinase ErbB-1
Type:
Receptor Kinase Domain
Mol. Mass.:
134279.59
Organism:
Homo sapiens (Human)
Description:
P00533
Residue:
1210
  
Component 3
Name:
Receptor tyrosine-protein kinase erbB-4
Synonyms:
ERBB4 Epidermal growth factor receptor ErbB-4 (HER4) Tyrosine Kinase Proto-oncogene c-ErbB-4 Receptor protein-tyrosine kinase erbB-4 Tyrosine kinase-type cell surface receptor HER4 (HER4)
Type:
Protein
Mol. Mass.:
146803.56
Organism:
Homo sapiens (Human)
Description:
Q15303
Residue:
1308
  
Component 4
Name:
Receptor tyrosine-protein kinase erbB-3
Synonyms:
ERBB3 HER3 Tyrosine kinase-type cell surface receptor HER3
Type:
PROTEIN
Mol. Mass.:
148097.73
Organism:
Homo sapiens (Human)
Description:
ChEMBL_774331
Residue:
1342
  
Inhibitor
Name:
BDBM50166941
Synonyms:
CHEMBL3797606
Type:
Small organic molecule
Emp. Form.:
C26H30N6O3S
Mol. Mass.:
506.62
SMILES:
COc1cc(ccc1Nc1ncc(SC)c(Oc2cccc(NC(=O)C=C)c2)n1)N1CCN(C)CC1
: