Target
Metabotropic glutamate receptor 4
Ligand
BDBM50166975
Substrate
Meas. Tech.
ChEMBL_1573310 (CHEMBL3804042)
EC50
0.689000±n/a nM
Citation
 Gogliotti, RDEngers, DWGarcia-Barrantes, PMPanarese, JDGentry, PRBlobaum, ALMorrison, RDDaniels, JSThompson, ADJones, CKConn, PJNiswender, CMLindsley, CWHopkins, CR Discovery of 3-aminopicolinamides as metabotropic glutamate receptor subtype 4 (mGlu4) positive allosteric modulator warheads engendering CNS exposure and in vivo efficacy. Bioorg Med Chem Lett 26:2915-2919 (2016)  
Target
Name:
Metabotropic glutamate receptor 4
Synonyms:
GPRC1D GRM4_HUMAN MGLUR4 Metabotropic glutamate receptor 4 (mGlu4) metabotropic glutamate 4
Type:
Protein
Mol. Mass.:
101899.95
Organism:
Homo sapiens (Human)
Description:
Q14833
Residue:
912
  
Inhibitor
Name:
BDBM50166975
Synonyms:
CHEMBL3799261
Type:
Small organic molecule
Emp. Form.:
C21H15ClN4O3
Mol. Mass.:
406.822
SMILES:
Cc1cccc2C(=O)N(C(=O)c12)c1ccc(NC(=O)c2ncccc2N)cc1Cl
: