Target
Beta-2 adrenergic receptor
Ligand
BDBM50167064
Substrate
Meas. Tech.
ChEMBL_1573533 (CHEMBL3801488)
EC50
210±n/a nM
Citation
 Weichert, DStanek, MHübner, HGmeiner, P Structure-guided development of dualß2 adrenergic/dopamine D2 receptor agonists. Bioorg Med Chem 24:2641-53 (2016)  
Target
Name:
Beta-2 adrenergic receptor
Synonyms:
ADRB2 ADRB2_HUMAN Beta-2 adrenoceptor | Beta-2 adrenoreceptor
Type:
Mol. Mass.:
46461.69
Organism:
Homo sapiens (Human)
Description:
P07550
Residue:
413
  
Inhibitor
Name:
BDBM50167064
Synonyms:
CHEMBL3797876
Type:
Small organic molecule
Emp. Form.:
C17H21NO5
Mol. Mass.:
319.3523
SMILES:
COc1ccccc1OCCNC[C@H](O)c1ccc(O)c(O)c1
: