Target
D(4) dopamine receptor
Ligand
BDBM50167064
Substrate
Meas. Tech.
ChEMBL_1573524 (CHEMBL3801479)
Ki
300±n/a nM
Citation
 Weichert, DStanek, MHübner, HGmeiner, P Structure-guided development of dualß2 adrenergic/dopamine D2 receptor agonists. Bioorg Med Chem 24:2641-53 (2016)  
Target
Name:
D(4) dopamine receptor
Synonyms:
D(2C) dopamine receptor DOPAMINE D4.2 DRD4 Dopamine D4 receptor
Type:
Enzyme
Mol. Mass.:
48373.19
Organism:
Homo sapiens (Human)
Description:
P21917
Residue:
419
  
Inhibitor
Name:
BDBM50167064
Synonyms:
CHEMBL3797876
Type:
Small organic molecule
Emp. Form.:
C17H21NO5
Mol. Mass.:
319.3523
SMILES:
COc1ccccc1OCCNC[C@H](O)c1ccc(O)c(O)c1
: