Target
Lanosterol synthase
Ligand
BDBM50167087
Substrate
Meas. Tech.
ChEMBL_1573537 (CHEMBL3801492)
IC50
574±n/a nM
Citation
 Zhao, ZHarrison, STSchubert, JWSanders, JMPolsky-Fisher, SZhang, NRMcLoughlin, DGibson, CRRobinson, RGSachs, NAKandebo, MYao, LSmith, SMHutson, PHWolkenberg, SEBarrow, JC Synthesis and optimization of N-heterocyclic pyridinones as catechol-O-methyltransferase (COMT) inhibitors. Bioorg Med Chem Lett 26:2952-2956 (2016)  
Target
Name:
Lanosterol synthase
Synonyms:
LSS_RAT Osc
Type:
PROTEIN
Mol. Mass.:
83302.12
Organism:
Rattus norvegicus
Description:
ChEMBL_12083
Residue:
733
  
Inhibitor
Name:
BDBM50167087
Synonyms:
CHEMBL3798113
Type:
Small organic molecule
Emp. Form.:
C15H11N3O2
Mol. Mass.:
265.2667
SMILES:
Oc1cn(ccc1=O)-c1cc(ccn1)-c1cccnc1
: