Target
Lanosterol synthase
Ligand
BDBM50167075
Substrate
Meas. Tech.
ChEMBL_1573537 (CHEMBL3801492)
IC50
>5000±n/a nM
Citation
 Zhao, ZHarrison, STSchubert, JWSanders, JMPolsky-Fisher, SZhang, NRMcLoughlin, DGibson, CRRobinson, RGSachs, NAKandebo, MYao, LSmith, SMHutson, PHWolkenberg, SEBarrow, JC Synthesis and optimization of N-heterocyclic pyridinones as catechol-O-methyltransferase (COMT) inhibitors. Bioorg Med Chem Lett 26:2952-2956 (2016)  
Target
Name:
Lanosterol synthase
Synonyms:
LSS_RAT Osc
Type:
PROTEIN
Mol. Mass.:
83302.12
Organism:
Rattus norvegicus
Description:
ChEMBL_12083
Residue:
733
  
Inhibitor
Name:
BDBM50167075
Synonyms:
CHEMBL3799278
Type:
Small organic molecule
Emp. Form.:
C12H10N4O2
Mol. Mass.:
242.2334
SMILES:
Cc1cn2nc(ccc2n1)-n1ccc(=O)c(O)c1
: