Target
Catechol O-methyltransferase
Ligand
BDBM50167086
Substrate
Meas. Tech.
ChEMBL_1573539 (CHEMBL3801494)
IC50
15±n/a nM
Citation
 Zhao, ZHarrison, STSchubert, JWSanders, JMPolsky-Fisher, SZhang, NRMcLoughlin, DGibson, CRRobinson, RGSachs, NAKandebo, MYao, LSmith, SMHutson, PHWolkenberg, SEBarrow, JC Synthesis and optimization of N-heterocyclic pyridinones as catechol-O-methyltransferase (COMT) inhibitors. Bioorg Med Chem Lett 26:2952-2956 (2016)  
Target
Name:
Catechol O-methyltransferase
Synonyms:
COMT_RAT Catechol-O-methyltransferase | Comt
Type:
Enzyme
Mol. Mass.:
29594.09
Organism:
Rattus norvegicus (Rat)
Description:
Residue:
264
  
Inhibitor
Name:
BDBM50167086
Synonyms:
CHEMBL3798212
Type:
Small organic molecule
Emp. Form.:
C17H17N3O2S
Mol. Mass.:
327.401
SMILES:
CC(C)(C)c1nc(cs1)-c1ccnc(c1)-n1ccc(=O)c(O)c1
: