Target
Steryl-sulfatase
Ligand
BDBM13058
Substrate
Meas. Tech.
ChEMBL_1574256 (CHEMBL3802439)
IC50
421±n/a nM
Citation
 El-Gamal, MISemreen, MHFoster, PAPotter, BV Design, synthesis, and biological evaluation of new arylamide derivatives possessing sulfonate or sulfamate moieties as steroid sulfatase enzyme inhibitors. Bioorg Med Chem 24:2762-7 (2016)  
Target
Name:
Steryl-sulfatase
Synonyms:
ARSC1 Arylsulfatase C STS_HUMAN Steryl-sulfate sulfohydrolase
Type:
Enzyme
Mol. Mass.:
65503.66
Organism:
Homo sapiens (Human)
Description:
P08842
Residue:
583
  
Inhibitor
Name:
BDBM13058
Synonyms:
6-oxo-6,7,8,9,10,11-hexahydrocyclohepta[c]chromen-3-yl sulfamate 667COUMATE CHEMBL286738 STX64 | {9-oxo-8-oxatricyclo[8.5.0.0^{2,7}]pentadeca-1(10),2(7),3,5-tetraen-5-yl} sulfamate
Type:
Small organic molecule
Emp. Form.:
C14H15NO5S
Mol. Mass.:
309.338
SMILES:
NS(=O)(=O)Oc1ccc2c3CCCCCc3c(=O)oc2c1
: