Target
Tryptophan 5-hydroxylase 1
Ligand
BDBM50167393
Substrate
Meas. Tech.
ChEBML_1574259
IC50
26±n/a nM
Citation
 Goldberg, DRDe Lombaert, SAiello, RBourassa, PBarucci, NZhang, QParalkar, VStein, AJValentine, JZavadoski, W Discovery of acyl guanidine tryptophan hydroxylase-1 inhibitors. Bioorg Med Chem Lett 26:2855-2860 (2016)  
Target
Name:
Tryptophan 5-hydroxylase 1
Synonyms:
TPH TPH1_HUMAN TRPH | Tryptophan 5-monooxygenase 1
Type:
PROTEIN
Mol. Mass.:
50990.64
Organism:
Homo sapiens (Human)
Description:
ChEMBL_1361824
Residue:
444
  
Inhibitor
Name:
BDBM50167393
Synonyms:
CHEMBL3799306
Type:
Small organic molecule
Emp. Form.:
C29H33N5O4
Mol. Mass.:
515.6034
SMILES:
N[C@@H](Cc1ccc(cc1)C(=O)\N=C(/N)NCc1c(Oc2ccccc2)cccc1N1CCCCC1)C(O)=O
: