Target
Tryptophan 5-hydroxylase 1
Ligand
BDBM50167394
Substrate
Meas. Tech.
ChEBML_1574259
IC50
16±n/a nM
Citation
 Goldberg, DRDe Lombaert, SAiello, RBourassa, PBarucci, NZhang, QParalkar, VStein, AJValentine, JZavadoski, W Discovery of acyl guanidine tryptophan hydroxylase-1 inhibitors. Bioorg Med Chem Lett 26:2855-2860 (2016)  
Target
Name:
Tryptophan 5-hydroxylase 1
Synonyms:
TPH TPH1_HUMAN TRPH | Tryptophan 5-monooxygenase 1
Type:
PROTEIN
Mol. Mass.:
50990.64
Organism:
Homo sapiens (Human)
Description:
ChEMBL_1361824
Residue:
444
  
Inhibitor
Name:
BDBM50167394
Synonyms:
CHEMBL3798405
Type:
Small organic molecule
Emp. Form.:
C30H35N5O5
Mol. Mass.:
545.6294
SMILES:
COc1ccc(Oc2cccc(N3CCCCC3)c2CN\C(N)=N\C(=O)c2ccc(C[C@H](N)C(O)=O)cc2)cc1
: