Target
Microtubule-associated protein 2
Ligand
BDBM50167960
Substrate
Meas. Tech.
ChEMBL_1574297 (CHEMBL3802682)
IC50
5.0±n/a nM
Citation
 Cheruvallath, ZTang, MMcBride, CKomandla, MMiura, JTon-Nu, TErikson, PFeng, JFarrell, PLawson, JDVanderpool, DWu, YDougan, DRPlonowski, AHolub, CLarson, C Discovery of potent, reversible MetAP2 inhibitors via fragment based drug discovery and structure based drug design-Part 1. Bioorg Med Chem Lett 26:2774-2778 (2016)  
Target
Name:
Microtubule-associated protein 2
Synonyms:
MAP-2 MTAP2_HUMAN
Type:
PROTEIN
Mol. Mass.:
199423.64
Organism:
Homo sapiens (Human)
Description:
ChEMBL_107603
Residue:
1827
  
Inhibitor
Name:
BDBM50167960
Synonyms:
CHEMBL3799512
Type:
Small organic molecule
Emp. Form.:
C17H16F3N5O
Mol. Mass.:
363.337
SMILES:
Cc1nc(ncc1-c1cc(cc2[nH]ncc12)C(F)(F)F)N1CC[C@@H](O)C1
: