Target
Cytochrome P450 1A2
Ligand
BDBM50167960
Substrate
Meas. Tech.
ChEMBL_1574299 (CHEMBL3802684)
IC50
<50119±n/a nM
Citation
 Cheruvallath, ZTang, MMcBride, CKomandla, MMiura, JTon-Nu, TErikson, PFeng, JFarrell, PLawson, JDVanderpool, DWu, YDougan, DRPlonowski, AHolub, CLarson, C Discovery of potent, reversible MetAP2 inhibitors via fragment based drug discovery and structure based drug design-Part 1. Bioorg Med Chem Lett 26:2774-2778 (2016)  
Target
Name:
Cytochrome P450 1A2
Synonyms:
CP1A2_HUMAN CYPIA2 Cytochrome P(3)450 Cytochrome P450 1A2 (CYP1A2) Cytochrome P450-P3
Type:
Enzyme
Mol. Mass.:
58423.38
Organism:
Homo sapiens (Human)
Description:
P05177
Residue:
516
  
Inhibitor
Name:
BDBM50167960
Synonyms:
CHEMBL3799512
Type:
Small organic molecule
Emp. Form.:
C17H16F3N5O
Mol. Mass.:
363.337
SMILES:
Cc1nc(ncc1-c1cc(cc2[nH]ncc12)C(F)(F)F)N1CC[C@@H](O)C1
: