Target
Adenosine receptor A2a
Ligand
BDBM50168108
Substrate
Meas. Tech.
ChEMBL_1575929 (CHEMBL3802552)
Ki
3.6±n/a nM
Citation
 Squarcialupi, LFalsini, MCatarzi, DVarano, FBetti, MVarani, KVincenzi, FDal Ben, DLambertucci, CVolpini, RColotta, V Exploring the 2- and 5-positions of the pyrazolo[4,3-d]pyrimidin-7-amino scaffold to target human A1 and A2A adenosine receptors. Bioorg Med Chem 24:2794-808 (2016)  
Target
Name:
Adenosine receptor A2a
Synonyms:
A2A adenosine receptor (hA2A) ADENOSINE A2 ADORA2 Adenosine A2A receptor (A2AAR)
Type:
G Protein-Coupled Receptor (GPCR)
Mol. Mass.:
44716.46
Organism:
Homo sapiens (Human)
Description:
P29274
Residue:
412
  
Inhibitor
Name:
BDBM50168108
Synonyms:
CHEMBL3799351
Type:
Small organic molecule
Emp. Form.:
C18H17N5O2
Mol. Mass.:
335.3599
SMILES:
COc1ccccc1Cn1cc2nc(nc(N)c2n1)-c1ccc(C)o1
: