Target
Steryl-sulfatase
Ligand
BDBM50151137
Substrate
Meas. Tech.
ChEMBL_1577322 (CHEMBL3808053)
Ki
500±n/a nM
Citation
 Shah, RSingh, JSingh, DJaggi, ASSingh, N Sulfatase inhibitors for recidivist breast cancer treatment: A chemical review. Eur J Med Chem 114:170-90 (2016)  
Target
Name:
Steryl-sulfatase
Synonyms:
ARSC1 Arylsulfatase C STS_HUMAN Steryl-sulfate sulfohydrolase
Type:
Enzyme
Mol. Mass.:
65503.66
Organism:
Homo sapiens (Human)
Description:
P08842
Residue:
583
  
Inhibitor
Name:
BDBM50151137
Synonyms:
2-Adamantan-1-yl-4-oxo-4H-thiochromene-6-carboxylic acid | CHEMBL186816
Type:
Small organic molecule
Emp. Form.:
C20H20O3S
Mol. Mass.:
340.436
SMILES:
OC(=O)c1ccc2sc(cc(=O)c2c1)C12CC3CC(CC(C3)C1)C2
: