Target
NAD-dependent protein deacetylase sirtuin-1
Ligand
BDBM50168905
Substrate
Meas. Tech.
ChEMBL_1577525 (CHEMBL3806934)
IC50
6560±n/a nM
Citation
 Ai, TWilson, DJMore, SSXie, JChen, L 5-((3-Amidobenzyl)oxy)nicotinamides as Sirtuin 2 Inhibitors. J Med Chem 59:2928-41 (2016)  
Target
Name:
NAD-dependent protein deacetylase sirtuin-1
Synonyms:
NAD-Dependent Deacetylase Sirtuin-1 NAD-dependent protein deacetylase sirtuin-1 (SIRT1) SIR2-like protein 1 SIRT1 Sirtuin-1 (SIRT1) | hSIR2
Type:
Developmental protein; hydrolase
Mol. Mass.:
81626.66
Organism:
Homo sapiens (Human)
Description:
Residue:
747
  
Inhibitor
Name:
BDBM50168905
Synonyms:
CHEMBL3805692
Type:
Small organic molecule
Emp. Form.:
C24H24N4O4
Mol. Mass.:
432.4718
SMILES:
NC(=O)c1cncc(OCc2cccc(NC(=O)c3ccc(cc3)N3CCOCC3)c2)c1
: