Target
Hexokinase-1
Ligand
BDBM50169032
Substrate
Meas. Tech.
ChEMBL_1577557 (CHEMBL3807033)
IC50
20±n/a nM
Citation
 Lin, HZeng, JXie, RSchulz, MJTedesco, RQu, JErhard, KFMack, JFRaha, KRendina, ARSzewczuk, LMKratz, PMJurewicz, AJCecconie, TMartens, SMcDevitt, PJMartin, JDChen, SBJiang, YNickels, LSchwartz, BJSmallwood, AZhao, BCampobasso, NQian, YBriand, JRominger, CMOleykowski, CHardwicke, MALuengo, JI Discovery of a Novel 2,6-Disubstituted Glucosamine Series of Potent and Selective Hexokinase 2 Inhibitors. ACS Med Chem Lett 7:217-22 (2016)  
Target
Name:
Hexokinase-1
Synonyms:
Brain form hexokinase HK1 Hexokinase type I hexokinase-1 isoform HKI
Type:
PROTEIN
Mol. Mass.:
102488.34
Organism:
Homo sapiens (Human)
Description:
EBI_11382
Residue:
917
  
Inhibitor
Name:
BDBM50169032
Synonyms:
CHEMBL3805398
Type:
Small organic molecule
Emp. Form.:
C24H24ClN3O7S
Mol. Mass.:
533.981
SMILES:
OC1O[C@H](CNS(=O)(=O)c2cnccc2Cl)[C@@H](O)[C@H](O)[C@H]1NC(=O)c1cccc(c1)-c1ccccc1
: