Target
Poly [ADP-ribose] polymerase tankyrase-1/tankyrase-2
Ligand
BDBM50169059
Substrate
Meas. Tech.
ChEMBL_1577627 (CHEMBL3807235)
EC50
48.0±n/a nM
Citation
 Abdel-Magid, AF Potential Use of Inhibitors of Tankyrases and PARP-1 as Treatment for Cancer and Other Diseases. ACS Med Chem Lett 7:209-10 (2016)  
Target
Name:
Poly [ADP-ribose] polymerase tankyrase-1/tankyrase-2
Synonyms:
Tankyrase 1/2
Type:
Mol. Mass.:
Description:
ASSAY_ID of ChEMBL is 1985233
Components:
This complex has 2 components.
Component 1
Name:
Poly [ADP-ribose] polymerase tankyrase-2
Synonyms:
(ARTD6 or PARP5b) Poly [ADP-ribose] polymerase tankyrase-2 TNKL TNKS2_HUMAN Tankyrase 2 Tankyrase-2 Tankyrase-2 (TNKS2)
Type:
Enzyme
Mol. Mass.:
126937.16
Organism:
Homo sapiens (Human)
Description:
Q9H2K2
Residue:
1166
  
Component 2
Name:
Poly [ADP-ribose] polymerase tankyrase-1
Synonyms:
(ARTD5 or PARP5a) PARPL Poly [ADP-ribose] polymerase tankyrase-1 TINF1 TNKS1 Tankyrase 1 Tankyrase-1 Tankyrase-1 (TNKS1)
Type:
Enzyme
Mol. Mass.:
142058.03
Organism:
Homo sapiens (Human)
Description:
O95271
Residue:
1327
  
Inhibitor
Name:
BDBM50169059
Synonyms:
CHEMBL3805627
Type:
Small organic molecule
Emp. Form.:
C23H25N5O3
Mol. Mass.:
419.4763
SMILES:
Cc1ccc2n1nc(CCCC(=O)N1CCC(CC1)Oc1ccc(cc1)C#N)[nH]c2=O
: